Dataset
is part of: research-data
type: TermProfile
preferred label: Conjunto de datos @es
preferred label: Datová sada @cs
preferred label: Jeu de données @fr
preferred label: Σύνολο Δεδομένων @el
preferred label: قائمة بيانات @ar
preferred label: データセット @ja
preferred label: Datasæt @da
definition: 1つのエージェントによって公開またはキュレートされ、1つ以上の形式でアクセスまたはダウンロードできるデータの集合。 @ja
definition: A conceptual entity that represents the information published.
definition: Konceptuální entita představující publikovaná data. @cs
definition: Raccolta di dati, pubblicati o curati da un'unica fonte, disponibili per l'accesso o il download in uno o più formati. @it
definition: Una colección de datos, publicados o conservados por una única fuente, y disponibles para ser accedidos o descargados en uno o más formatos. @es
definition: Une collection de données, publiée ou élaborée par une seule source, et disponible pour accès ou téléchargement dans un ou plusieurs formats. @fr
definition: Μία συλλογή από δεδομένα, δημοσιευμένη ή επιμελημένη από μία και μόνο πηγή, διαθέσιμη δε προς πρόσβαση ή μεταφόρτωση σε μία ή περισσότερες μορφές. @el
definition: قائمة بيانات منشورة أو مجموعة من قبل مصدر ما و متاح الوصول إليها أو تحميلها @ar
definition: En samling af data, udgivet eller udvalgt og arrangeret af en enkelt kilde og som er til råde for adgang til eller download af i en eller flere repræsentationer. @da
specializes: Resource
profile of: Dataset
type: ClassProfile

Person
is part of: research-data
type: TermProfile
definition: Physical person.
specializes: Agent
reuses property value: PropertyValueReuse
  reused property: prefLabel
  reused from resource: Person
type: ClassProfile
class: Person

Organization
is part of: research-data
type: TermProfile
definition: Represents a collection of people organized together into a community or other social, commercial or political structure. The group has some common purpose or reason for existence which goes beyond the set of people belonging to it and can act as an Agent. Organizations are often decomposable into hierarchical structures.
specializes: Agent
profile of: Agent
reuses property value: PropertyValueReuse
  reused property: prefLabel
  reused from resource: Organization
type: ClassProfile
class: Organization

Terms of use
is part of: research-data
type: TermProfile
definition: Terms of use defines overall conditions and rights regarding access and usage of dataset.
type: ClassProfile
class: Rights

Distribution
is part of: research-data
type: TermProfile
scope note: This represents a general availability of a dataset. It implies no information about the actual access method of the data, i.e., whether by direct download, API, or through a Web page. This is an abstract type. Use its subclasses to determine downloadable file or data service.
profile of: Distribution
reuses property value: PropertyValueReuse
  reused property: prefLabel
  reused from resource: Distribution
reuses property value: PropertyValueReuse
  reused property: definition
  reused from resource: Distribution
type: ClassProfile

Validation result
is part of: research-data
type: TermProfile
definition: Class describing the result of validation testing. It may include validation of metadata, data and/or web services accessing the data.
type: ClassProfile
class: ValidationResult

Subject
is part of: research-data
type: TermProfile
scope note: Recommended approach is to use controlled list values, preferably in the form of IRI.
reuses property value: PropertyValueReuse
  reused property: prefLabel
  reused from resource: Subject
reuses property value: PropertyValueReuse
  reused property: definition
  reused from resource: Subject
type: ClassProfile
class: Subject

Related resource
is part of: research-data
type: TermProfile
definition: Resource represents any resource, physical or digital, that is related to the described dataset.
scope note: Class is used for description of the resource together with the type of relation, for which is used value from codelist https://vocabs.ccmm.cz/registry/codelist/RelationType/. Distributions of the datasets SHALL NOT be modeled as related resource, but as a distribution. Use qualified resource property to link to the dataset class. Examples of resources: other related dataset, used methodology, instrument used for measurement, conference or conference paper etc...
specializes: Resource
type: ClassProfile
class: Resource

Resource to agent relationship
is part of: research-data
type: TermProfile
definition: An association class for attaching additional information to a relationship between Resource and Agent.
scope note: Use to characterize a relationship between resources and agents, where the nature of the relationship is known but is not adequately characterized by the standard DCTERMS properties (dcterms:hasPart, dcterms:isPartOf, dcterms:conformsTo, dcterms:isFormatOf, dcterms:hasFormat, dcterms:isVersionOf, dcterms:hasVersion, dcterms:replaces, dcterms:isReplacedBy, dcterms:references, dcterms:isReferencedBy, dcterms:requires, dcterms:isRequiredBy) or PROV-O properties (prov:wasDerivedFrom, prov:wasInfluencedBy, prov:wasQuotedFrom, prov:wasRevisionOf, prov:hadPrimarySource, prov:alternateOf, prov:specializationOf). Roles of the agent in the relation are specified using had role relation.
type: ClassProfile
class: ResourceToAgentRelationship

Resource agent role type
is part of: research-data
type: TermProfile
definition: Role of the agent in the relationship to the resource.
scope note: Use value from code list https://vocabs.ccmm.cz/registry/codelist/AgentRole/.
type: ClassProfile
class: Concept

Contact details
is part of: research-data
type: TermProfile
definition: Details to contact the agent in a relationship to the resource.
scope note: Describes contact details, such as telephone, e--mail address etc.
type: ClassProfile
class: ContactDetails

Address
is part of: research-data
type: TermProfile
definition: A spatial object that in a human-readable way identifies a fixed location.
scope note: Address shall refer to the IRI identifier of an address from existing Address registry (e.g. RÚIAN for Czechia). In cases, where address identifier does not exist or cannot be used, fill address details using class attributes.
reuses property value: PropertyValueReuse
  reused property: prefLabel
  reused from resource: Address
type: ClassProfile
class: Address

Metadata Record
is part of: research-data
type: TermProfile
preferred label: Katalogizační záznam @cs
preferred label: Record di catalogo @it
preferred label: Registre du catalogue @fr
preferred label: Registro del catálogo @es
preferred label: Καταγραφή καταλόγου @el
preferred label: سجل @ar
preferred label: カタログ・レコード @ja
preferred label: Katalogpost @da
definition: 1つのデータセットを記述したデータ・カタログ内のレコード。 @ja
definition: Description of the metadata record of the dataset.
definition: Un record in un catalogo di dati che descrive un singolo dataset o servizio di dati. @it
definition: Un registre du catalogue ou une entrée du catalogue, décrivant un seul jeu de données. @fr
definition: Un registro en un catálogo de datos que describe un solo conjunto de datos o un servicio de datos. @es
definition: Záznam v datovém katalogu popisující jednu datovou sadu či datovou službu. @cs
definition: Μία καταγραφή ενός καταλόγου, η οποία περιγράφει ένα συγκεκριμένο σύνολο δεδομένων. @el
definition: En post i et datakatalog der beskriver registreringen af et enkelt datasæt eller en datatjeneste. @da
scope note: In case metadata is harvested from external catalogue, metadata record IRI shall be the same as IRI of the metadata record in original repository.
profile of: CatalogueRecord
type: ClassProfile

Application profile
is part of: research-data
type: TermProfile
definition: A standard or other specification to which a metadata record conforms.
profile of: Standard
reuses property value: PropertyValueReuse
  reused property: scopeNote
  reused from resource: Standard
type: ClassProfile

ProvenanceStatement
is part of: research-data
type: TermProfile
definition: Information about entities, activities, and people involved in producing a piece of data or thing.
profile of: ProvenanceStatement
reuses property value: PropertyValueReuse
  reused property: prefLabel
  reused from resource: ProvenanceStatement
type: ClassProfile

Repository
is part of: research-data
type: TermProfile
preferred label: Catalogo @it
preferred label: Catalogue @fr
preferred label: Catálogo @es
preferred label: Katalog @cs
preferred label: Κατάλογος @el
preferred label: فهرس قوائم البيانات @ar
preferred label: カタログ @ja
profile of: Catalogue
reuses property value: PropertyValueReuse
  reused property: definition
  reused from resource: Catalogue
reuses property value: PropertyValueReuse
  reused property: scopeNote
  reused from resource: Catalogue
type: ClassProfile

Distribution - downloadable file
is part of: research-data
type: TermProfile
definition: Physical embodiment of the dataset in a particular format.
specializes: Distribution
type: ClassProfile
class: Distribution-DownloadableFile

Distribution - data service
is part of: research-data
type: TermProfile
definition: Physical embodiment of the dataset distribution as a particular data service.
specializes: Distribution
type: ClassProfile
class: Distribution-DataService

File
is part of: research-data
type: TermProfile
definition: Digital resource representing collection of data.
scope note: File is represented by URL on which is it accessable.
profile of: rdfs-Resource
type: ClassProfile

MediaType
is part of: research-data
type: TermProfile
definition: A file format.
scope note: Use IRI value from registry https://www.iana.org/assignments/media-types/media-types.xhtml.
profile of: MediaType
reuses property value: PropertyValueReuse
  reused property: prefLabel
  reused from resource: MediaType
type: ClassProfile

Documentation
is part of: research-data
type: TermProfile
definition: A textual resource intended for human consumption that contains information about the data service.
profile of: Document
reuses property value: PropertyValueReuse
  reused property: scopeNote
  reused from resource: Document
type: ClassProfile

Subject scheme
is part of: research-data
type: TermProfile
definition: Collection of subjects (keywords, concepts, classification codes) curated by a single source.
scope note: Subject scheme sets a contexts for all subjects within this scheme. It usually represents thesauri, vocabulary etc., but may also represent a set of concepts with the meaning of the same context, such as domain specific nomenclature.
type: ClassProfile
class: SubjectScheme

Location
is part of: research-data
type: TermProfile
definition: Spatial region, named place or geometry representation of a place related to the resource.
scope note: Location is represented according to the Open Formal Standard for Spatial Data. Locations are represented as a reference to the named place, geographic region or specific geometry according to the standardized geometry object representation. Every Location instance must have at least one of the following attributes/relations: bbox, location name, geometry and/or related object identifier.
profile of: Location
reuses property value: PropertyValueReuse
  reused property: prefLabel
  reused from resource: Location
type: ClassProfile
class: Geolocation

Geometry
is part of: research-data
type: TermProfile
definition: The Geometry class provides the means to identify a location as a point, line, polygon, etc. expressed using coordinates in some coordinate reference system.
profile of: Geometry
reuses property value: PropertyValueReuse
  reused property: prefLabel
  reused from resource: Geometry
reuses property value: PropertyValueReuse
  reused property: scopeNote
  reused from resource: Geometry
type: ClassProfile

Identifier
is part of: research-data
type: TermProfile
definition: Unique and resolvable identifier containing the notation and identifier scheme in the form of URI.
reuses property value: PropertyValueReuse
  reused property: prefLabel
  reused from resource: Identifier
reuses property value: PropertyValueReuse
  reused property: scopeNote
  reused from resource: undefined-identifier:
type: ClassProfile
class: Identifier

Alternate title
is part of: research-data
type: TermProfile
definition: Alternate title of the resource.
type: ClassProfile
class: AlternateTitle

Checksum
is part of: research-data
type: TermProfile
scope note: This class allows the results of a variety of checksum and cryptographic message digest algorithms to be represented.
profile of: Checksum
reuses property value: PropertyValueReuse
  reused property: prefLabel
  reused from resource: Checksum
reuses property value: PropertyValueReuse
  reused property: definition
  reused from resource: Checksum
type: ClassProfile

Checksum algorithm
is part of: research-data
type: TermProfile
definition: Algorithm used for Checksums.
profile of: ChecksumAlgorithm
reuses property value: PropertyValueReuse
  reused property: scopeNote
  reused from resource: ChecksumAlgorithm
type: ClassProfile

LicenseDocument
is part of: research-data
type: TermProfile
scope note: A legal document giving official permission to do something with a resource.
profile of: LicenseDocument
reuses property value: PropertyValueReuse
  reused property: prefLabel
  reused from resource: LicenseDocument
reuses property value: PropertyValueReuse
  reused property: definition
  reused from resource: LicenseDocument
type: ClassProfile

Location relation type
is part of: research-data
type: TermProfile
definition: Relation of the dataset to the resource.
scope note: Use value from codelist https://vocabs.ccmm.cz/registry/codelist/LocationRelation/.
type: ClassProfile
class: Concept

Alternate title type
is part of: research-data
type: TermProfile
definition: Type of alternate title.
scope note: Use value from codelist https://vocabs.ccmm.cz/registry/codelist/AlternateTitle/.
type: ClassProfile
class: Concept

Date type
is part of: research-data
type: TermProfile
definition: Type of a date in relation to the resource.
scope note: Use value from codelist https://vocabs.ccmm.cz/registry/codelist/TimeReference/.
type: ClassProfile
class: Concept

Resource type
is part of: research-data
type: TermProfile
definition: Type of the resource.
scope note: Use IRI identifier of the resource type from the codelist https://vocabularies.coar-repositories.org/resource_types/.
type: ClassProfile
class: Concept

Resource relation type
is part of: research-data
type: TermProfile
definition: Type of the relation between the dataset and given resource.
scope note: Use value from the codelist https://vocabs.ccmm.cz/registry/codelist/RelationType/.
type: ClassProfile
class: Concept

Language system
is part of: research-data
type: TermProfile
scope note: Use IRI identifier from the register http://publications.europa.eu/resource/authority/language.
profile of: LinguisticSystem
reuses property value: PropertyValueReuse
  reused property: definition
  reused from resource: LinguisticSystem
type: ClassProfile

Format
is part of: research-data
type: TermProfile
definition: Format of downloadable file.
scope note: Use IRI identifier from the register http://publications.europa.eu/resource/dataset/file-type. Human readable codelist representation is here: https://op.europa.eu/en/web/eu-vocabularies/concept-scheme/-/resource?uri=http://publications.europa.eu/resource/authority/file-type.
profile of: MediaTypeOrExtent
type: ClassProfile

Access rights
is part of: research-data
type: TermProfile
definition: A statement about the access rights to the dataset.
scope note: Use IRI identifier from the register http://purl.org/coar/access_right/.
profile of: RightsStatement
type: ClassProfile

Time representation
is part of: research-data
type: TermProfile
preferred label: entidad temporal @es
definition: Representation of time reference as a temporal interval or instant on which something relevant to the resource has happened.
definition: Un intervalo temporal o un instante. @es
type: ClassProfile
class: TemporalEntity

Time instant
is part of: research-data
type: TermProfile
preferred label: instante de tiempo. @es
definition: A temporal entity with zero extent or duration.
definition: Una entidad temporal con una extensión o duración cero. @es
scope note: Use for representation of time reference with zero extent or duration.
specializes: Time representation
type: ClassProfile
class: Instant

TimeInterval
is part of: research-data
type: TermProfile
scope note: Use for representation of time reference represented as an interval. Interval is represented by beginning and end time instants.
specializes: Time representation
reuses property value: PropertyValueReuse
  reused property: prefLabel
  reused from resource: Interval
reuses property value: PropertyValueReuse
  reused property: definition
  reused from resource: Interval
type: ClassProfile
class: Interval

IdentifierScheme
is part of: research-data
type: TermProfile
scope note: Use identifier scheme in the form of IRI identifier. Methodology shall list known sources.
reuses property value: PropertyValueReuse
  reused property: prefLabel
  reused from resource: IdentifierScheme
reuses property value: PropertyValueReuse
  reused property: definition
  reused from resource: IdentifierScheme
type: ClassProfile
class: IdentifierScheme

Description
is part of: research-data
type: TermProfile
scope note: Description of the resource may have also a description type.
reuses property value: PropertyValueReuse
  reused property: prefLabel
  reused from resource: Description
reuses property value: PropertyValueReuse
  reused property: definition
  reused from resource: Description
type: ClassProfile
class: Description

DescriptionType
is part of: research-data
type: TermProfile
scope note: Use value from codelist https://vocabs.ccmm.cz/registry/codelist/DescriptionType/.
reuses property value: PropertyValueReuse
  reused property: prefLabel
  reused from resource: DescriptionType
reuses property value: PropertyValueReuse
  reused property: definition
  reused from resource: DescriptionType
type: ClassProfile
class: DescriptionType

TimeReference
is part of: research-data
type: TermProfile
definition: An object representing time reference relevant to some event related to the resource has happened.
reuses property value: PropertyValueReuse
  reused property: prefLabel
  reused from resource: TimeReference
type: ClassProfile
class: TimeReference

Resource
is part of: research-data
type: TermProfile
scope note: In the core model, resource is anything that is described within the metadata record, including dataset itself and all related resources. This class is also reused in domain extension for representing any physical or digital resources specific for the described scientific domain.
reuses property value: PropertyValueReuse
  reused property: prefLabel
  reused from resource: Resource
reuses property value: PropertyValueReuse
  reused property: definition
  reused from resource: Resource
type: ClassProfile
class: Resource

has related resource
is part of: research-data
type: TermProfile
definition: Reference to the resource in any way related to the described dataset.
property: hasRelatedResource
domain: Dataset
type: ObjectPropertyProfile
object property range: Related resource

has terms of use
is part of: research-data
type: TermProfile
cardinality: https://w3id.org/dsv/cardinality#11
property: hasRights
domain: Dataset
type: ObjectPropertyProfile
object property range: Terms of use

Dataset.hasFundingReference
is part of: research-data
type: TermProfile
definition: Has reference for funding of a dataset acquisition.
reuses property value: PropertyValueReuse
  reused property: prefLabel
  reused from resource: hasFundingReference
cardinality: 0n
property: hasFundingReference
domain: Dataset
type: ObjectPropertyProfile
object property range: FundingReference

has distribution
is part of: research-data
type: TermProfile
scope note: For the distribution of data in the form of files use instances of class Distribution – downloadable file. For the distribution of data through service use instance of class Distribution – data service.
profile of: Dataset.datasetDistribution
reuses property value: PropertyValueReuse
  reused property: definition
  reused from resource: Dataset.datasetDistribution
domain: Dataset
type: ObjectPropertyProfile
object property range: Distribution

has validation result
is part of: research-data
type: TermProfile
definition: Reference to the report about the dataset validation.
property: hasValidationResult
domain: Dataset
type: ObjectPropertyProfile
object property range: Validation result

Dataset.hasSubject
is part of: research-data
type: TermProfile
definition: Dataset described using a subject.
scope note: At least one subject must be a value from FRASCATI FORD vocabulary. For that subject use reference codelist https://vocabs.ccmm.cz/registry/codelist/SubjectCategory/ as the Subject scheme and select at least one value from this codelist as a subject.
reuses property value: PropertyValueReuse
  reused property: prefLabel
  reused from resource: hasSubject
cardinality: 1n
property: hasSubject
domain: Dataset
type: ObjectPropertyProfile
object property range: Subject

has time reference
is part of: research-data
type: TermProfile
definition: Reference to events related to the dataset.
scope note: Must contain at least one time reference with date type value "Created" from https://vocabs.ccmm.cz/registry/codelist/TimeReference/.
cardinality: 1n
property: hasTimeReference
domain: Dataset
type: ObjectPropertyProfile
object property range: TimeReference

has related agent
is part of: research-data
type: TermProfile
definition: Specifies the agent an a given role in the relationship with the resource.
profile of: Relationship.relation
cardinality: https://w3id.org/dsv/cardinality#11
domain: Resource to agent relationship
type: ObjectPropertyProfile
object property range: Agent

ResourceToAgentRelationship.hadRole
is part of: research-data
type: TermProfile
scope note: May be used in a qualified-attribution to specify the role of an Agent with respect to an Entity. It is recommended that the value be taken from a controlled vocabulary of agent roles.
profile of: Relationship.hadRole
reuses property value: PropertyValueReuse
  reused property: prefLabel
  reused from resource: Relationship.hadRole
reuses property value: PropertyValueReuse
  reused property: definition
  reused from resource: Relationship.hadRole
cardinality: https://w3id.org/dsv/cardinality#11
domain: Resource to agent relationship
type: ObjectPropertyProfile
object property range: Resource agent role type

has funder
is part of: research-data
type: TermProfile
definition: Relation to the agent entity of a funder.
cardinality: 1n
property: hasFunderIdentifier
domain: FundingReference
type: ObjectPropertyProfile
object property range: Agent

has contact point
is part of: research-data
type: TermProfile
preferred label: Punto de contacto @es
preferred label: má kontaktní bod @cs
preferred label: point de contact @fr
preferred label: punto di contatto @it
preferred label: σημείο επικοινωνίας @el
preferred label: عنوان اتصال @ar
preferred label: 窓口 @ja
preferred label: kontaktpunkt @da
definition: Información relevante de contacto para el recurso catalogado. Se recomienda el uso de vCard. @es
definition: Informazioni di contatto rilevanti per la risorsa catalogata. Si raccomanda l'uso di vCard. @it
definition: Relevant contact information for the catalogued resource.
definition: Relevantní kontaktní informace pro katalogizovaný zdroj. Doporučuje se použít slovník VCard. @cs
definition: Relie un jeu de données à une information de contact utile en utilisant VCard. @fr
definition: Συνδέει ένα σύνολο δεδομένων με ένα σχετικό σημείο επικοινωνίας, μέσω VCard. @el
definition: تربط قائمة البيانات بعنوان اتصال موصف باستخدام VCard @ar
definition: データセットを、VCardを用いて提供されている適切な連絡先情報にリンクします。 @ja
definition: Relevante kontaktoplysninger for den katalogiserede ressource. Anvendelse af vCard anbefales. @da
cardinality: 0n
property: contactPoint
domain: Agent
type: ObjectPropertyProfile
object property range: Contact details

ContactDetails.hasAddress
is part of: research-data
type: TermProfile
scope note: Either links to IRI of address in address registry or describes the address using Address class attributes.
reuses property value: PropertyValueReuse
  reused property: prefLabel
  reused from resource: hasAddress
reuses property value: PropertyValueReuse
  reused property: definition
  reused from resource: hasAddress
cardinality: 0n
property: hasAddress
domain: Contact details
type: ObjectPropertyProfile
object property range: Address

has affiliation
is part of: research-data
type: TermProfile
definition: Affiliation of the person to an organization.
property: hasAffiliation
domain: Person
type: ObjectPropertyProfile
object property range: Organization

conforms to standard
is part of: research-data
type: TermProfile
definition: An established standard to which the metadata record conforms.
scope note: This property SHOULD be used to indicate the standard or profile that was used to describe cataloged resource content.
profile of: CatalogRecord.conformsTo
cardinality: 1n
domain: Metadata Record
type: ObjectPropertyProfile
object property range: Application profile

has provenance
is part of: research-data
type: TermProfile
profile of: Dataset.provenance
reuses property value: PropertyValueReuse
  reused property: definition
  reused from resource: Dataset.provenance
reuses property value: PropertyValueReuse
  reused property: scopeNote
  reused from resource: Dataset.provenance
cardinality: 0n
domain: Dataset
type: ObjectPropertyProfile
object property range: ProvenanceStatement

has original repository
is part of: research-data
type: TermProfile
definition: Link to the repository in which the metadata were originally stored and curated.
scope note: Original repository is a repository where the original metadata was harvested from or where it was created and/or published. There is always exactly one original repository. If metadata record is harvested form other repository, make sure to include the first repository from which it was harvested.
cardinality: https://w3id.org/dsv/cardinality#11
property: originalRepository
domain: Metadata Record
type: ObjectPropertyProfile
object property range: Repository

describes
is part of: research-data
type: TermProfile
definition: Dataset described by the metadata record.
property: describes
domain: Metadata Record
type: ObjectPropertyProfile
object property range: Dataset

Distribution-DownloadableFile.downloadUrl
is part of: research-data
type: TermProfile
scope note: Download URL SHOULD be used for the URL at which this distribution is available directly, typically through a HTTP Get request.
profile of: Distribution.downloadUrl
reuses property value: PropertyValueReuse
  reused property: prefLabel
  reused from resource: Distribution.downloadUrl
reuses property value: PropertyValueReuse
  reused property: definition
  reused from resource: Distribution.downloadUrl
domain: Distribution - downloadable file
type: ObjectPropertyProfile
object property range: File

Distribution-DownloadableFile.accessUrl
is part of: research-data
type: TermProfile
scope note: The resource at the access URL contains information about how to get the Dataset. It shall be the web page (not a document file).
profile of: Distribution.accessUrl
reuses property value: PropertyValueReuse
  reused property: prefLabel
  reused from resource: Distribution.accessUrl
reuses property value: PropertyValueReuse
  reused property: definition
  reused from resource: Distribution.accessUrl
domain: Distribution - downloadable file
type: ObjectPropertyProfile
object property range: File

Distribution-DownloadableFile.mediaType
is part of: research-data
type: TermProfile
scope note: This property SHOULD be used when the media type of the distribution is defined in IANA (using value from https://www.iana.org/assignments/media-types/media-types.xhtml), otherwise Format MAY be used with values from Publication Office of the EU File type codelist http://publications.europa.eu/resource/dataset/file-type.
profile of: Distribution.mediaType
reuses property value: PropertyValueReuse
  reused property: prefLabel
  reused from resource: Distribution.mediaType
reuses property value: PropertyValueReuse
  reused property: definition
  reused from resource: Distribution.mediaType
domain: Distribution - downloadable file
type: ObjectPropertyProfile
object property range: MediaType

conforms to schema
is part of: research-data
type: TermProfile
scope note: This property SHOULD be used to indicate the model, schema, ontology, view or profile that this representation of a dataset conforms to. This is (generally) a complementary concern to the media-type or format.
profile of: Distribution.linkedSchemas
reuses property value: PropertyValueReuse
  reused property: definition
  reused from resource: Distribution.linkedSchemas
cardinality: 0n
domain: Distribution - downloadable file
type: ObjectPropertyProfile
object property range: Application profile

has access service
is part of: research-data
type: TermProfile
preferred label: servicio de acceso de datos @es
preferred label: servizio di accesso ai dati @it
preferred label: služba pro přístup k datům @cs
preferred label: dataadgangstjeneste @da
scope note: Access service SHOULD be used to link to a description of Data service that can provide access to this distribution.
profile of: Distribution.accessService
reuses property value: PropertyValueReuse
  reused property: definition
  reused from resource: Distribution.accessService
domain: Distribution - data service
type: ObjectPropertyProfile
object property range: DataService

conforms to specification
is part of: research-data
type: TermProfile
scope note: This property SHOULD be used to indicate the profile or specification that this data service conforms to. This is (generally) a complementary concern to the service standard.
profile of: Distribution.linkedSchemas
reuses property value: PropertyValueReuse
  reused property: definition
  reused from resource: Distribution.linkedSchemas
domain: Distribution - data service
type: ObjectPropertyProfile
object property range: Application profile

has documentation
is part of: research-data
type: TermProfile
profile of: Distribution.documentation
reuses property value: PropertyValueReuse
  reused property: definition
  reused from resource: Distribution.documentation
reuses property value: PropertyValueReuse
  reused property: scopeNote
  reused from resource: Distribution.documentation
domain: Distribution - data service
type: ObjectPropertyProfile
object property range: Documentation

has contact point
is part of: research-data
type: TermProfile
preferred label: Punto de contacto @es
preferred label: kontaktní bod @cs
preferred label: point de contact @fr
preferred label: punto di contatto @it
preferred label: σημείο επικοινωνίας @el
preferred label: عنوان اتصال @ar
preferred label: 窓口 @ja
preferred label: kontaktpunkt @da
definition: Información relevante de contacto para el recurso catalogado. Se recomienda el uso de vCard. @es
definition: Informazioni di contatto rilevanti per la risorsa catalogata. Si raccomanda l'uso di vCard. @it
definition: Contact point for the further details about the terms of use.
definition: Relevantní kontaktní informace pro katalogizovaný zdroj. Doporučuje se použít slovník VCard. @cs
definition: Relie un jeu de données à une information de contact utile en utilisant VCard. @fr
definition: Συνδέει ένα σύνολο δεδομένων με ένα σχετικό σημείο επικοινωνίας, μέσω VCard. @el
definition: تربط قائمة البيانات بعنوان اتصال موصف باستخدام VCard @ar
definition: データセットを、VCardを用いて提供されている適切な連絡先情報にリンクします。 @ja
definition: Relevante kontaktoplysninger for den katalogiserede ressource. Anvendelse af vCard anbefales. @da
property: contactPoint
domain: Terms of use
type: ObjectPropertyProfile
object property range: Agent

in subject scheme
is part of: research-data
type: TermProfile
definition: Belonging of the subject to the subject scheme.
cardinality: https://w3id.org/dsv/cardinality#01
property: inSubjectScheme
domain: Subject
type: ObjectPropertyProfile
object property range: Subject scheme

has location
is part of: research-data
type: TermProfile
scope note: In the CCMM spatial coverage does not only cover the area of dataset, it may be connected to the dataset in some other way, e.g. the place from where the data were measured, administrative area to which the dataset conforms or other.
profile of: Dataset.geographicalCoverage
reuses property value: PropertyValueReuse
  reused property: definition
  reused from resource: Dataset.geographicalCoverage
domain: Dataset
type: ObjectPropertyProfile
object property range: Location

has related object
is part of: research-data
type: TermProfile
definition: Relation to the spatial object.
scope note: The relation is provided by the identifier of the related object. It shall be identifier of an existing spatial object in a registry, such as Place Named Authority List (http://publications.europa.eu/resource/authority/place), Register of Territorial Identification, Addresses and Real Estates or others.
property: hasRelatedResource
domain: Location
type: ObjectPropertyProfile
object property range: Related resource

has geometry
is part of: research-data
type: TermProfile
scope note: The range of this property allows for any type of geometry specification. E.g., the geometry could be encoded by a literal, as WKT (geosparql:wktLiteral), or represented by a class, as geosparql:Geometry (or any of its subclasses).
profile of: Location.geometry
reuses property value: PropertyValueReuse
  reused property: definition
  reused from resource: Location.geometry
cardinality: 0n
domain: Location
type: ObjectPropertyProfile
object property range: Geometry

has identifier
is part of: research-data
type: TermProfile
definition: has identifier
cardinality: 1n
property: hasIdentifier
domain: Dataset
type: ObjectPropertyProfile
object property range: Identifier

is described by
is part of: research-data
type: TermProfile
definition: Inverse relation between dataset and metadata record.
cardinality: 1n
property: isDescribedBy
domain: Dataset
type: ObjectPropertyProfile
object property range: Metadata Record

has identifier
is part of: research-data
type: TermProfile
definition: has identifier
cardinality: 0n
property: hasIdentifier
domain: Agent
type: ObjectPropertyProfile
object property range: Identifier

MetadataRecord.qualifiedRelation
is part of: research-data
type: TermProfile
definition: Enlace a una descripción de la relación con otro recurso. @es
definition: Link a una descrizione di una relazione con un'altra risorsa. @it
definition: Link to a description of a relationship between metadata record and agent with the specification of the role of agent in this relationship.
definition: Odkaz na popis vztahu s jiným zdrojem. @cs
definition: Reference til en beskrivelse af en relation til en anden ressource. @da
scope note: Relationship shall contain at least one agent with role "Data Manager" from codelist https://vocabs.ccmm.cz/registry/codelist/AgentRole/.
reuses property value: PropertyValueReuse
  reused property: prefLabel
  reused from resource: CataloguedResource.qualifiedRelation
cardinality: 1n
domain: Metadata Record
type: ObjectPropertyProfile
object property range: Resource to agent relationship

uses algorithm
is part of: research-data
type: TermProfile
profile of: Checksum.algorithm
reuses property value: PropertyValueReuse
  reused property: definition
  reused from resource: Checksum.algorithm
reuses property value: PropertyValueReuse
  reused property: scopeNote
  reused from resource: Checksum.algorithm
cardinality: https://w3id.org/dsv/cardinality#11
domain: Checksum
type: ObjectPropertyProfile
object property range: Checksum algorithm

has checksum
is part of: research-data
type: TermProfile
profile of: Distribution.checksum
reuses property value: PropertyValueReuse
  reused property: definition
  reused from resource: Distribution.checksum
reuses property value: PropertyValueReuse
  reused property: scopeNote
  reused from resource: Distribution.checksum
cardinality: https://w3id.org/dsv/cardinality#01
domain: Distribution - downloadable file
type: ObjectPropertyProfile
object property range: Checksum

has license
is part of: research-data
type: TermProfile
definition: Reference to the legal document giving official permission to do something with the resource.
cardinality: https://w3id.org/dsv/cardinality#11
property: license
domain: Terms of use
type: ObjectPropertyProfile
object property range: LicenseDocument

language
is part of: research-data
type: TermProfile
definition: A language used in the textual metadata describing titles, descriptions of the metadata record.
profile of: CatalogueRecord.language
reuses property value: PropertyValueReuse
  reused property: scopeNote
  reused from resource: CatalogueRecord.language
cardinality: 0n
domain: Metadata Record
type: ObjectPropertyProfile
object property range: Language system

has primary language
is part of: research-data
type: TermProfile
definition: A primary language of the Dataset.
profile of: Dataset.language
cardinality: https://w3id.org/dsv/cardinality#01
domain: Dataset
type: ObjectPropertyProfile
object property range: Language system

has other language
is part of: research-data
type: TermProfile
definition: Any other languages of the Dataset.
profile of: Dataset.language
reuses property value: PropertyValueReuse
  reused property: scopeNote
  reused from resource: Dataset.language
cardinality: 0n
domain: Dataset
type: ObjectPropertyProfile
object property range: Language system

has format
is part of: research-data
type: TermProfile
profile of: Distribution.format
reuses property value: PropertyValueReuse
  reused property: definition
  reused from resource: Distribution.format
cardinality: https://w3id.org/dsv/cardinality#11
domain: Distribution - downloadable file
type: ObjectPropertyProfile
object property range: Format

access rights
is part of: research-data
type: TermProfile
definition: Information about the conditions to access the resource or an indication of its security status.
cardinality: https://w3id.org/dsv/cardinality#11
property: accessRights
domain: Terms of use
type: ObjectPropertyProfile
object property range: Access rights

TimeInterval.hasBeginning
is part of: research-data
type: TermProfile
definition: Time instant representing the beginning of a temporal interval.
definition: Comienzo de una entidad temporal. @es
reuses property value: PropertyValueReuse
  reused property: prefLabel
  reused from resource: hasBeginning
cardinality: https://w3id.org/dsv/cardinality#11
property: hasBeginning
domain: TimeInterval
type: ObjectPropertyProfile
object property range: Time instant

TimeInterval.hasEnd
is part of: research-data
type: TermProfile
definition: Time instant representing the end of a temporal interval.
definition: Final de una entidad temporal. @es
reuses property value: PropertyValueReuse
  reused property: prefLabel
  reused from resource: hasEnd
cardinality: https://w3id.org/dsv/cardinality#11
property: hasEnd
domain: TimeInterval
type: ObjectPropertyProfile
object property range: Time instant

has date type
is part of: research-data
type: TermProfile
definition: Reference to the codelist of date types.
cardinality: https://w3id.org/dsv/cardinality#11
property: hasType
domain: TimeReference
type: ObjectPropertyProfile
object property range: Date type

has resource relation type
is part of: research-data
type: TermProfile
definition: Relation to the relation type between dataset and resource.
scope note: Use value from https://vocabs.ccmm.cz/registry/codelist/RelationType/.
cardinality: https://w3id.org/dsv/cardinality#01
property: hasType
domain: Related resource
type: ObjectPropertyProfile
object property range: Resource relation type

has location relation type
is part of: research-data
type: TermProfile
definition: Relation of the location to the dataset.
scope note: Use values from codelist https://vocabs.ccmm.cz/registry/codelist/LocationRelation/.
cardinality: https://w3id.org/dsv/cardinality#11
property: hasType
domain: Location
type: ObjectPropertyProfile
object property range: Location relation type

has alternate title type
is part of: research-data
type: TermProfile
definition: Type of the alternate name relation.
scope note: References to the value from https://vocabs.ccmm.cz/registry/codelist/AlternateTitle/.
cardinality: https://w3id.org/dsv/cardinality#01
property: hasType
domain: Alternate title
type: ObjectPropertyProfile
object property range: Alternate title type

Dataset.hasDescription
is part of: research-data
type: TermProfile
definition: Relation to the description of a dataset.
scope note: Description may have various type from the codelist https://vocabs.ccmm.cz/registry/codelist/DescriptionType/.
reuses property value: PropertyValueReuse
  reused property: prefLabel
  reused from resource: hasDescription
cardinality: 0n
property: hasDescription
domain: Dataset
type: ObjectPropertyProfile
object property range: Description

Description.hasDescriptionType
is part of: research-data
type: TermProfile
scope note: Type of the description from the codelist https://vocabs.ccmm.cz/registry/codelist/DescriptionType/.
reuses property value: PropertyValueReuse
  reused property: prefLabel
  reused from resource: hasDescriptionType
reuses property value: PropertyValueReuse
  reused property: definition
  reused from resource: hasDescriptionType
cardinality: https://w3id.org/dsv/cardinality#01
property: hasDescriptionType
domain: Description
type: ObjectPropertyProfile
object property range: DescriptionType

has temporal representation
is part of: research-data
type: TermProfile
reuses property value: PropertyValueReuse
  reused property: definition
  reused from resource: 7cl7lurvb8jmhhjx1ct
cardinality: https://w3id.org/dsv/cardinality#11
domain: TimeReference
type: ObjectPropertyProfile
object property range: Time representation

Resource.qualifiedRelation
is part of: research-data
type: TermProfile
scope note: Link to a description of a relationship between resource and an agent with the specification of the role of agent in this relationship.
reuses property value: PropertyValueReuse
  reused property: prefLabel
  reused from resource: qualifiedRelation
reuses property value: PropertyValueReuse
  reused property: definition
  reused from resource: qualifiedRelation
cardinality: 0n
property: qualifiedRelation
domain: Resource
type: ObjectPropertyProfile
object property range: Resource to agent relationship

Resource.hasTimeReference
is part of: research-data
type: TermProfile
definition: Reference to events related to the resource.
reuses property value: PropertyValueReuse
  reused property: prefLabel
  reused from resource: hasTimeReference
cardinality: 0n
property: hasTimeReference
domain: Resource
type: ObjectPropertyProfile
object property range: TimeReference

has resource type
is part of: research-data
type: TermProfile
definition: The resource type of the resource.
scope note: Use IRI identifier of a value from the register https://vocabularies.coar-repositories.org/resource_types/.
cardinality: https://w3id.org/dsv/cardinality#01
property: type
domain: Resource
type: ObjectPropertyProfile
object property range: Resource type

title
is part of: research-data
type: TermProfile
definition: A name given to the dataset.
cardinality: https://w3id.org/dsv/cardinality#11
property: title
domain: Dataset
type: DatatypePropertyProfile
datatype property range: string

version
is part of: research-data
type: TermProfile
profile of: Dataset.version
reuses property value: PropertyValueReuse
  reused property: definition
  reused from resource: Dataset.version
cardinality: https://w3id.org/dsv/cardinality#01
domain: Dataset
type: DatatypePropertyProfile
datatype property range: string

publication year
is part of: research-data
type: TermProfile
scope note: If TimeReference with dateType "Issued" is present, year in that date and publicationYear must be the same“
reuses property value: PropertyValueReuse
  reused property: definition
  reused from resource: relatedItemPublicationYear
cardinality: https://w3id.org/dsv/cardinality#11
property: relatedItemPublicationYear
domain: Dataset
type: DatatypePropertyProfile
datatype property range: gYear

local identifier
is part of: research-data
type: TermProfile
definition: The code assigned by the funder to a sponsored award (grant).
scope note: In case the award or grant has an ID or DOI, the full URL shall be included.
cardinality: https://w3id.org/dsv/cardinality#01
property: awardNumber
domain: FundingReference
type: DatatypePropertyProfile
datatype property range: string

award title
is part of: research-data
type: TermProfile
definition: The human readable title or name of the award (grant).
cardinality: https://w3id.org/dsv/cardinality#01
property: awardTitle
domain: FundingReference
type: DatatypePropertyProfile
datatype property range: string

funding program
is part of: research-data
type: TermProfile
definition: Reference to the specific funding program.
cardinality: https://w3id.org/dsv/cardinality#01
property: fundingProgram
domain: FundingReference
type: DatatypePropertyProfile
datatype property range: anyURI

phone
is part of: research-data
type: TermProfile
definition: Phone number
scope note: Phone number in international format +xx(x) xxx xxx xxx
cardinality: 0n
property: phone
domain: Contact details
type: DatatypePropertyProfile
datatype property range: string

email
is part of: research-data
type: TermProfile
definition: Email address.
scope note: Email address in standard format, e.g. john.doe@domain.com
cardinality: 0n
property: email
domain: Contact details
type: DatatypePropertyProfile
datatype property range: string

data box
is part of: research-data
type: TermProfile
definition: Code of the data box.
cardinality: 0n
property: dataBox
domain: Contact details
type: DatatypePropertyProfile
datatype property range: string

given name
is part of: research-data
type: TermProfile
definition: The given name associated with the person.
cardinality: 0n
property: given-name
domain: Person
type: DatatypePropertyProfile
datatype property range: string

family name
is part of: research-data
type: TermProfile
definition: The family name associated with the person.
cardinality: 0n
property: family-name
domain: Person
type: DatatypePropertyProfile
datatype property range: string

alternate name
is part of: research-data
type: TermProfile
reuses property value: PropertyValueReuse
  reused property: definition
  reused from resource: organization-name
cardinality: 0n
property: organization-name
domain: Organization
type: DatatypePropertyProfile
datatype property range: text

date created
is part of: research-data
type: TermProfile
definition: The date on which the metadata record was created.
cardinality: https://w3id.org/dsv/cardinality#01
property: created
domain: Metadata Record
type: DatatypePropertyProfile
datatype property range: date

date updated
is part of: research-data
type: TermProfile
scope note: The date on which the metadata record was changed or modified.
reuses property value: PropertyValueReuse
  reused property: definition
  reused from resource: modified
cardinality: 0n
property: modified
domain: Metadata Record
type: DatatypePropertyProfile
datatype property range: date

title
is part of: research-data
type: TermProfile
definition: A name given to the distribution.
cardinality: https://w3id.org/dsv/cardinality#11
property: title
domain: Distribution
type: DatatypePropertyProfile
datatype property range: string

byte size
is part of: research-data
type: TermProfile
definition: The size of a Distribution in bytes.
profile of: Distribution.byteSize
cardinality: https://w3id.org/dsv/cardinality#11
domain: Distribution - downloadable file
type: DatatypePropertyProfile
datatype property range: integer

description
is part of: research-data
type: TermProfile
definition: A free-text account of the Distribution.
scope note: This property can be repeated for parallel language versions of the description.
profile of: Distribution.description
cardinality: 0n
domain: Distribution - data service
type: DatatypePropertyProfile
datatype property range: text

description
is part of: research-data
type: TermProfile
definition: Descriptive text on details of rights and licensing.
cardinality: 0n
property: description
domain: Terms of use
type: DatatypePropertyProfile
datatype property range: text

classification code
is part of: research-data
type: TermProfile
definition: The classification code used for notation of the subject term in the subject scheme.
cardinality: https://w3id.org/dsv/cardinality#01
property: subjectClassificationCode
domain: Subject
type: DatatypePropertyProfile
datatype property range: string

title
is part of: research-data
type: TermProfile
definition: Title of the subject.
cardinality: 1n
property: title
domain: Subject
type: DatatypePropertyProfile
datatype property range: langString

definition
is part of: research-data
type: TermProfile
definition: Definition of the subject in the given context.
scope note: Context is usually given by the subject scheme representing specific thesauri, vocabulary or simply a context (domain specific group at an university etc.).
cardinality: 0n
property: definition
domain: Subject
type: DatatypePropertyProfile
datatype property range: text

name
is part of: research-data
type: TermProfile
definition: Name of the spatial location.
scope note: Name of the place. Examples: Prague Castle, Tour d'Eiffel, Šumava National Park
cardinality: 0n
property: title
domain: Location
type: DatatypePropertyProfile
datatype property range: text

bounding box
is part of: research-data
type: TermProfile
definition: Bounding box of the location geometry.
scope note: Typically defined by top-left and bottom-right corners.
cardinality: 0n
property: bbox
domain: Location
type: DatatypePropertyProfile
datatype property range: Literal

date information
is part of: research-data
type: TermProfile
definition: Additional information to the date in text form.
scope note: Write any additional information needed to understand the meaning of event that happened in the given time.
cardinality: https://w3id.org/dsv/cardinality#01
property: dateInformation
domain: TimeReference
type: DatatypePropertyProfile
datatype property range: text

value
is part of: research-data
type: TermProfile
definition: Value of the identifer within the given identifier scheme.
cardinality: https://w3id.org/dsv/cardinality#11
property: notation
domain: Identifier
type: DatatypePropertyProfile
datatype property range: string

label
is part of: research-data
type: TermProfile
definition: Human readable name of the repository.
cardinality: 0n
property: label
domain: Repository
type: DatatypePropertyProfile
datatype property range: langString

label
is part of: research-data
type: TermProfile
definition: Label of application profile
cardinality: 0n
property: label
domain: Application profile
type: DatatypePropertyProfile
datatype property range: langString

label
is part of: research-data
type: TermProfile
definition: Label of the subject scheme.
cardinality: 0n
property: label
domain: Subject scheme
type: DatatypePropertyProfile
datatype property range: langString

label
is part of: research-data
type: TermProfile
definition: Documentation label
cardinality: 0n
property: label
domain: Documentation
type: DatatypePropertyProfile
datatype property range: langString

label
is part of: research-data
type: TermProfile
definition: Media type label.
cardinality: 0n
property: label
domain: MediaType
type: DatatypePropertyProfile
datatype property range: langString

label
is part of: research-data
type: TermProfile
definition: File label
cardinality: 0n
property: label
domain: File
type: DatatypePropertyProfile
datatype property range: langString

label
is part of: research-data
type: TermProfile
definition: Label of geometry object.
cardinality: 0n
property: label
domain: Geometry
type: DatatypePropertyProfile
datatype property range: langString

label
is part of: research-data
type: TermProfile
definition: Label of the validation result.
cardinality: 0n
property: label
domain: Validation result
type: DatatypePropertyProfile
datatype property range: langString

label
is part of: research-data
type: TermProfile
definition: Provenance state label.
cardinality: 0n
property: label
domain: ProvenanceStatement
type: DatatypePropertyProfile
datatype property range: langString

label
is part of: research-data
type: TermProfile
definition: Address label
cardinality: 0n
property: label
domain: Address
type: DatatypePropertyProfile
datatype property range: langString

title
is part of: research-data
type: TermProfile
definition: A human-readable name for the subject.
cardinality: 1n
property: title
domain: Alternate title
type: DatatypePropertyProfile
datatype property range: langString

Funder name
is part of: research-data
type: TermProfile
definition: Funder name
cardinality: 0n
property: label
domain: 1zylaqq71pbm7x55j3o
type: DatatypePropertyProfile
datatype property range: string

label
is part of: research-data
type: TermProfile
definition: Data service label
cardinality: 0n
property: label
domain: DataService
type: DatatypePropertyProfile
datatype property range: langString

label
is part of: research-data
type: TermProfile
definition: Resource agent role type label.
scope note: Use label of the corresponding value from code list https://vocabs.ccmm.cz/registry/codelist/AgentRole/.
cardinality: 0n
property: label
domain: Resource agent role type
type: DatatypePropertyProfile
datatype property range: langString

resource URL
is part of: research-data
type: TermProfile
definition: Human readable resolvable URL representing the resource.
scope note: Resource URL represents human readable resolvable representation of the resource. Same url must be aslo in c:iri.
cardinality: https://w3id.org/dsv/cardinality#01
property: resourceUrl
domain: Related resource
type: DatatypePropertyProfile
datatype property range: anyURI

checksum value
is part of: research-data
type: TermProfile
definition: A lower case hexadecimal encoded digest value produced using a specific algorithm.
scope note: Value is generated automatically using given algorithm.
profile of: Checksum.checksumValue
cardinality: https://w3id.org/dsv/cardinality#11
domain: Checksum
type: DatatypePropertyProfile
datatype property range: hexBinary

name
is part of: research-data
type: TermProfile
definition: Name of the agent.
scope note: It is used for the official name of the agent. For Persons it is combination of first and family names. Recommended format is "family names, first names".
cardinality: https://w3id.org/dsv/cardinality#11
property: name
domain: Agent
type: DatatypePropertyProfile
datatype property range: string

full address
is part of: research-data
type: TermProfile
definition: The complete address written as a string.
scope note: Use of this property is recommended as it will not suffer any misunderstandings that might arise through the breaking up of an address into its component parts. This property is analogous to vCard's label property but with two important differences: (1) formatting is not assumed so that, unlike vCard label, it may not be suitable to print this on an address label, (2) vCard's label property has a domain of vCard Address; the fullAddress property has no such restriction. An example of a full address is "Champ de Mars, 5 Avenue Anatole France, 75007 Paris, France".
property: fullAddress
domain: Address
type: DatatypePropertyProfile
datatype property range: string

post office box
is part of: research-data
type: TermProfile
definition: A location designator for a postal delivery point at a post office, usually a number.
property: poBox
domain: Address
type: DatatypePropertyProfile
datatype property range: string

thoroughfare
is part of: research-data
type: TermProfile
definition: The name of a passage or way through from one location to another.
scope note: A thoroughfare is usually a street, but it might be a waterway or some other feature. For example, "Avenue des Champs-Élysées".
property: thoroughfare
domain: Address
type: DatatypePropertyProfile
datatype property range: string

locator designator
is part of: research-data
type: TermProfile
definition: A number or sequence of characters that uniquely identifies the locator within the relevant scope.
scope note: In simpler terms, this is the building number, apartment number, etc. For an address such as "Flat 3, 17 Bridge Street", the locator is "flat 3, 17".
property: locatorDesignator
domain: Address
type: DatatypePropertyProfile
datatype property range: string

locator name
is part of: research-data
type: TermProfile
definition: Proper noun(s) applied to the real world entity identified by the locator. The locator name could be the name of the property or complex, of the building or part of the building, or it could be the name of a room inside a building.
scope note: The locator name could be the name of the property or complex, of the building or part of the building, or it could be the name of a room inside a building. The key difference between a locator designator and a locator name is that the latter is a proper name and is unlikely to include digits. For example, "Shumann, Berlaymont" is a meeting room within the European Commission headquarters for which locator name is more appropriate than locator.
property: locatorName
domain: Address
type: DatatypePropertyProfile
datatype property range: string

address area
is part of: research-data
type: TermProfile
definition: The name of a geographic area that groups Addresses.
scope note: This would typically be part of a city, a neighbourhood or village, e.g. Montmartre. Address area is not an administrative unit.
property: addressArea
domain: Address
type: DatatypePropertyProfile
datatype property range: string

post name
is part of: research-data
type: TermProfile
definition: A name created and maintained for postal purposes to identify a subdivision of addresses and postal delivery points.
scope note: Usually a city, for example "Paris". Eventually name of the post itself.
property: postName
domain: Address
type: DatatypePropertyProfile
datatype property range: string

administrative unit level 1
is part of: research-data
type: TermProfile
definition: The name of the uppermost level of the address, almost always a country.
scope note: Best practice is to use the ISO 3166-1 code but if this is inappropriate for the context, country names should be provided in a consistent manner to reduce ambiguity. For example, either write 'France' or 'FRA' consistently throughout the dataset and avoid mixing the two. The Country controlled vocabulary from the Publications Office can be reused for this.
property: adminUnitL1
domain: Address
type: DatatypePropertyProfile
datatype property range: string

administrative unit level 2
is part of: research-data
type: TermProfile
definition: The name of a secondary level/region of the address, usually a county, state or other such area that typically encompasses several localities.
scope note: Values could be a region or province, more granular than level 1.
property: adminUnitL2
domain: Address
type: DatatypePropertyProfile
datatype property range: string

post code
is part of: research-data
type: TermProfile
definition: The code created and maintained for postal purposes to identify a subdivision of addresses and postal delivery points.
scope note: Post codes are common elements in many countries' postal address systems. One of the many post codes of Paris is for example "75000".
property: postCode
domain: Address
type: DatatypePropertyProfile
datatype property range: string

label
is part of: research-data
type: TermProfile
definition: Label of the license document.
property: label
domain: LicenseDocument
type: DatatypePropertyProfile
datatype property range: langString

label
is part of: research-data
type: TermProfile
definition: Label of format value.
scope note: Use a label of a codelist value from http://publications.europa.eu/resource/dataset/file-type.
property: label
domain: Format
type: DatatypePropertyProfile
datatype property range: langString

label
is part of: research-data
type: TermProfile
definition: Language label
scope note: Use language label and/or its 3-letter code from http://publications.europa.eu/resource/authority/language/.
property: label
domain: Language system
type: DatatypePropertyProfile
datatype property range: langString

label
is part of: research-data
type: TermProfile
definition: Label of the access rights vocabulary value.
scope note: Short label of the value from register http://purl.org/coar/access_right/. Allowed English values are 'embargoes access', 'metadata only access', 'open access' and 'restricted access'.
property: label
domain: Access rights
type: DatatypePropertyProfile
datatype property range: langString

label
is part of: research-data
type: TermProfile
definition: Label of the resource type.
property: label
domain: Resource type
type: DatatypePropertyProfile
datatype property range: langString

date
is part of: research-data
type: TermProfile
definition: Position of an instant, expressed using xsd:date.
scope note: Each time instant SHALL have exactly one date OR date time stamp attribute.
cardinality: https://w3id.org/dsv/cardinality#01
property: inXSDDate
domain: Time instant
type: DatatypePropertyProfile
datatype property range: date

label
is part of: research-data
type: TermProfile
definition: Date type label.
property: label
domain: Date type
type: DatatypePropertyProfile
datatype property range: langString

label
is part of: research-data
type: TermProfile
definition: Label of the relation type.
scope note: Use label of corresponding value from code list https://vocabs.ccmm.cz/registry/codelist/RelationType/.
property: label
domain: Resource relation type
type: DatatypePropertyProfile
datatype property range: langString

label
is part of: research-data
type: TermProfile
definition: Label of location relation type.
property: label
domain: Location relation type
type: DatatypePropertyProfile
datatype property range: langString

label
is part of: research-data
type: TermProfile
definition: Alternate title type label.
scope note: Use label of a respective value from https://vocabs.ccmm.cz/registry/codelist/AlternateTitle/.
property: label
domain: Alternate title type
type: DatatypePropertyProfile
datatype property range: langString

label
is part of: research-data
type: TermProfile
definition: Identifier scheme label
scope note: E.g. DOI, ORCID etc...
property: label
domain: IdentifierScheme
type: DatatypePropertyProfile
datatype property range: langString

date time
is part of: research-data
type: TermProfile
definition: Date with timestamp represented as xsd:dateTime.
scope note: Each time instant SHALL have exactly one date OR date time attribute. Maintanance note: In the draft on newest version of Time ontology, in XSD date-time is deprecated and replaced with in XSD date-time-stamp.
cardinality: https://w3id.org/dsv/cardinality#01
property: inXSDDateTime
domain: Time instant
type: DatatypePropertyProfile
datatype property range: dateTime

well known text literal
is part of: research-data
type: TermProfile
definition: Representation of geometry object as WKT Literal.
cardinality: https://w3id.org/dsv/cardinality#01
property: asWKT
domain: Geometry
type: DatatypePropertyProfile
datatype property range: wktLiteral

geography markup language literal
is part of: research-data
type: TermProfile
definition: Representation of geometry object as GML Literal.
cardinality: https://w3id.org/dsv/cardinality#01
property: asGML
domain: Geometry
type: DatatypePropertyProfile
datatype property range: gmlLiteral

label
is part of: research-data
type: TermProfile
definition: Label of the description type.
property: label
domain: DescriptionType
type: DatatypePropertyProfile
datatype property range: langString

authorized
is part of: research-data
type: TermProfile
scope note: This attribute shall be filled mainly for ORCiD identifiers of Persons. It serves to determine whether the person in the repository is really the person it is meant to be.
reuses property value: PropertyValueReuse
  reused property: definition
  reused from resource: authorized
cardinality: https://w3id.org/dsv/cardinality#01
property: authorized
domain: Identifier
type: DatatypePropertyProfile
datatype property range: boolean

title
is part of: research-data
type: TermProfile
reuses property value: PropertyValueReuse
  reused property: definition
  reused from resource: title
cardinality: https://w3id.org/dsv/cardinality#01
property: title
domain: Resource
type: DatatypePropertyProfile
datatype property range: string